test_capture_persistent_scale_axis_filter_selftest_and_FIFO_change_rejected (test_embedded.Embedded.test_capture_persistent_scale_axis_filter_selftest_and_FIFO_change_rejected) ... 
  test_capture_persistent_scale_axis_filter_selftest_and_FIFO_change_rejected (test_embedded.Embedded.test_capture_persistent_scale_axis_filter_selftest_and_FIFO_change_rejected) (address=16, value=168) ... FAIL
  test_capture_persistent_scale_axis_filter_selftest_and_FIFO_change_rejected (test_embedded.Embedded.test_capture_persistent_scale_axis_filter_selftest_and_FIFO_change_rejected) (address=16, value=164) ... FAIL
  test_capture_persistent_scale_axis_filter_selftest_and_FIFO_change_rejected (test_embedded.Embedded.test_capture_persistent_scale_axis_filter_selftest_and_FIFO_change_rejected) (address=16, value=174) ... FAIL
  test_capture_persistent_scale_axis_filter_selftest_and_FIFO_change_rejected (test_embedded.Embedded.test_capture_persistent_scale_axis_filter_selftest_and_FIFO_change_rejected) (address=16, value=12) ... FAIL
  test_capture_persistent_scale_axis_filter_selftest_and_FIFO_change_rejected (test_embedded.Embedded.test_capture_persistent_scale_axis_filter_selftest_and_FIFO_change_rejected) (address=18, value=64) ... FAIL
  test_capture_persistent_scale_axis_filter_selftest_and_FIFO_change_rejected (test_embedded.Embedded.test_capture_persistent_scale_axis_filter_selftest_and_FIFO_change_rejected) (address=18, value=4) ... FAIL
  test_capture_persistent_scale_axis_filter_selftest_and_FIFO_change_rejected (test_embedded.Embedded.test_capture_persistent_scale_axis_filter_selftest_and_FIFO_change_rejected) (address=18, value=76) ... FAIL
  test_capture_persistent_scale_axis_filter_selftest_and_FIFO_change_rejected (test_embedded.Embedded.test_capture_persistent_scale_axis_filter_selftest_and_FIFO_change_rejected) (address=18, value=100) ... FAIL
  test_capture_persistent_scale_axis_filter_selftest_and_FIFO_change_rejected (test_embedded.Embedded.test_capture_persistent_scale_axis_filter_selftest_and_FIFO_change_rejected) (address=19, value=1) ... FAIL
  test_capture_persistent_scale_axis_filter_selftest_and_FIFO_change_rejected (test_embedded.Embedded.test_capture_persistent_scale_axis_filter_selftest_and_FIFO_change_rejected) (address=20, value=1) ... FAIL
  test_capture_persistent_scale_axis_filter_selftest_and_FIFO_change_rejected (test_embedded.Embedded.test_capture_persistent_scale_axis_filter_selftest_and_FIFO_change_rejected) (address=21, value=1) ... FAIL
  test_capture_persistent_scale_axis_filter_selftest_and_FIFO_change_rejected (test_embedded.Embedded.test_capture_persistent_scale_axis_filter_selftest_and_FIFO_change_rejected) (address=22, value=2) ... FAIL
  test_capture_persistent_scale_axis_filter_selftest_and_FIFO_change_rejected (test_embedded.Embedded.test_capture_persistent_scale_axis_filter_selftest_and_FIFO_change_rejected) (address=23, value=4) ... FAIL
  test_capture_persistent_scale_axis_filter_selftest_and_FIFO_change_rejected (test_embedded.Embedded.test_capture_persistent_scale_axis_filter_selftest_and_FIFO_change_rejected) (address=7, value=64) ... FAIL
  test_capture_persistent_scale_axis_filter_selftest_and_FIFO_change_rejected (test_embedded.Embedded.test_capture_persistent_scale_axis_filter_selftest_and_FIFO_change_rejected) (address=8, value=1) ... FAIL
  test_capture_persistent_scale_axis_filter_selftest_and_FIFO_change_rejected (test_embedded.Embedded.test_capture_persistent_scale_axis_filter_selftest_and_FIFO_change_rejected) (address=8, value=128) ... FAIL
  test_capture_persistent_scale_axis_filter_selftest_and_FIFO_change_rejected (test_embedded.Embedded.test_capture_persistent_scale_axis_filter_selftest_and_FIFO_change_rejected) (address=9, value=0) ... FAIL
  test_capture_persistent_scale_axis_filter_selftest_and_FIFO_change_rejected (test_embedded.Embedded.test_capture_persistent_scale_axis_filter_selftest_and_FIFO_change_rejected) (address=10, value=1) ... FAIL
  test_capture_persistent_scale_axis_filter_selftest_and_FIFO_change_rejected (test_embedded.Embedded.test_capture_persistent_scale_axis_filter_selftest_and_FIFO_change_rejected) (address=10, value=22) ... FAIL
  test_capture_persistent_scale_axis_filter_selftest_and_FIFO_change_rejected (test_embedded.Embedded.test_capture_persistent_scale_axis_filter_selftest_and_FIFO_change_rejected) (address=13, value=8) ... FAIL

======================================================================
FAIL: test_capture_persistent_scale_axis_filter_selftest_and_FIFO_change_rejected (test_embedded.Embedded.test_capture_persistent_scale_axis_filter_selftest_and_FIFO_change_rejected) (address=16, value=168)
----------------------------------------------------------------------
Traceback (most recent call last):
  File "/Users/guman/Documents/Codex/2026-10-05/kai-3/work/v37/negative-baseline/tests/test_embedded.py", line 194, in test_capture_persistent_scale_axis_filter_selftest_and_FIFO_change_rejected
    ret,_=self.drain(ctx,cap);self.assertEqual(ret,-1);self.assertEqual(cap.quality,4)
                              ^^^^^^^^^^^^^^^^^^^^^^^^
AssertionError: 0 != -1

======================================================================
FAIL: test_capture_persistent_scale_axis_filter_selftest_and_FIFO_change_rejected (test_embedded.Embedded.test_capture_persistent_scale_axis_filter_selftest_and_FIFO_change_rejected) (address=16, value=164)
----------------------------------------------------------------------
Traceback (most recent call last):
  File "/Users/guman/Documents/Codex/2026-10-05/kai-3/work/v37/negative-baseline/tests/test_embedded.py", line 194, in test_capture_persistent_scale_axis_filter_selftest_and_FIFO_change_rejected
    ret,_=self.drain(ctx,cap);self.assertEqual(ret,-1);self.assertEqual(cap.quality,4)
                              ^^^^^^^^^^^^^^^^^^^^^^^^
AssertionError: 0 != -1

======================================================================
FAIL: test_capture_persistent_scale_axis_filter_selftest_and_FIFO_change_rejected (test_embedded.Embedded.test_capture_persistent_scale_axis_filter_selftest_and_FIFO_change_rejected) (address=16, value=174)
----------------------------------------------------------------------
Traceback (most recent call last):
  File "/Users/guman/Documents/Codex/2026-10-05/kai-3/work/v37/negative-baseline/tests/test_embedded.py", line 194, in test_capture_persistent_scale_axis_filter_selftest_and_FIFO_change_rejected
    ret,_=self.drain(ctx,cap);self.assertEqual(ret,-1);self.assertEqual(cap.quality,4)
                              ^^^^^^^^^^^^^^^^^^^^^^^^
AssertionError: 0 != -1

======================================================================
FAIL: test_capture_persistent_scale_axis_filter_selftest_and_FIFO_change_rejected (test_embedded.Embedded.test_capture_persistent_scale_axis_filter_selftest_and_FIFO_change_rejected) (address=16, value=12)
----------------------------------------------------------------------
Traceback (most recent call last):
  File "/Users/guman/Documents/Codex/2026-10-05/kai-3/work/v37/negative-baseline/tests/test_embedded.py", line 194, in test_capture_persistent_scale_axis_filter_selftest_and_FIFO_change_rejected
    ret,_=self.drain(ctx,cap);self.assertEqual(ret,-1);self.assertEqual(cap.quality,4)
                              ^^^^^^^^^^^^^^^^^^^^^^^^
AssertionError: 0 != -1

======================================================================
FAIL: test_capture_persistent_scale_axis_filter_selftest_and_FIFO_change_rejected (test_embedded.Embedded.test_capture_persistent_scale_axis_filter_selftest_and_FIFO_change_rejected) (address=18, value=64)
----------------------------------------------------------------------
Traceback (most recent call last):
  File "/Users/guman/Documents/Codex/2026-10-05/kai-3/work/v37/negative-baseline/tests/test_embedded.py", line 194, in test_capture_persistent_scale_axis_filter_selftest_and_FIFO_change_rejected
    ret,_=self.drain(ctx,cap);self.assertEqual(ret,-1);self.assertEqual(cap.quality,4)
                              ^^^^^^^^^^^^^^^^^^^^^^^^
AssertionError: 0 != -1

======================================================================
FAIL: test_capture_persistent_scale_axis_filter_selftest_and_FIFO_change_rejected (test_embedded.Embedded.test_capture_persistent_scale_axis_filter_selftest_and_FIFO_change_rejected) (address=18, value=4)
----------------------------------------------------------------------
Traceback (most recent call last):
  File "/Users/guman/Documents/Codex/2026-10-05/kai-3/work/v37/negative-baseline/tests/test_embedded.py", line 194, in test_capture_persistent_scale_axis_filter_selftest_and_FIFO_change_rejected
    ret,_=self.drain(ctx,cap);self.assertEqual(ret,-1);self.assertEqual(cap.quality,4)
                              ^^^^^^^^^^^^^^^^^^^^^^^^
AssertionError: 0 != -1

======================================================================
FAIL: test_capture_persistent_scale_axis_filter_selftest_and_FIFO_change_rejected (test_embedded.Embedded.test_capture_persistent_scale_axis_filter_selftest_and_FIFO_change_rejected) (address=18, value=76)
----------------------------------------------------------------------
Traceback (most recent call last):
  File "/Users/guman/Documents/Codex/2026-10-05/kai-3/work/v37/negative-baseline/tests/test_embedded.py", line 194, in test_capture_persistent_scale_axis_filter_selftest_and_FIFO_change_rejected
    ret,_=self.drain(ctx,cap);self.assertEqual(ret,-1);self.assertEqual(cap.quality,4)
                              ^^^^^^^^^^^^^^^^^^^^^^^^
AssertionError: 0 != -1

======================================================================
FAIL: test_capture_persistent_scale_axis_filter_selftest_and_FIFO_change_rejected (test_embedded.Embedded.test_capture_persistent_scale_axis_filter_selftest_and_FIFO_change_rejected) (address=18, value=100)
----------------------------------------------------------------------
Traceback (most recent call last):
  File "/Users/guman/Documents/Codex/2026-10-05/kai-3/work/v37/negative-baseline/tests/test_embedded.py", line 194, in test_capture_persistent_scale_axis_filter_selftest_and_FIFO_change_rejected
    ret,_=self.drain(ctx,cap);self.assertEqual(ret,-1);self.assertEqual(cap.quality,4)
                              ^^^^^^^^^^^^^^^^^^^^^^^^
AssertionError: 0 != -1

======================================================================
FAIL: test_capture_persistent_scale_axis_filter_selftest_and_FIFO_change_rejected (test_embedded.Embedded.test_capture_persistent_scale_axis_filter_selftest_and_FIFO_change_rejected) (address=19, value=1)
----------------------------------------------------------------------
Traceback (most recent call last):
  File "/Users/guman/Documents/Codex/2026-10-05/kai-3/work/v37/negative-baseline/tests/test_embedded.py", line 194, in test_capture_persistent_scale_axis_filter_selftest_and_FIFO_change_rejected
    ret,_=self.drain(ctx,cap);self.assertEqual(ret,-1);self.assertEqual(cap.quality,4)
                              ^^^^^^^^^^^^^^^^^^^^^^^^
AssertionError: 0 != -1

======================================================================
FAIL: test_capture_persistent_scale_axis_filter_selftest_and_FIFO_change_rejected (test_embedded.Embedded.test_capture_persistent_scale_axis_filter_selftest_and_FIFO_change_rejected) (address=20, value=1)
----------------------------------------------------------------------
Traceback (most recent call last):
  File "/Users/guman/Documents/Codex/2026-10-05/kai-3/work/v37/negative-baseline/tests/test_embedded.py", line 194, in test_capture_persistent_scale_axis_filter_selftest_and_FIFO_change_rejected
    ret,_=self.drain(ctx,cap);self.assertEqual(ret,-1);self.assertEqual(cap.quality,4)
                              ^^^^^^^^^^^^^^^^^^^^^^^^
AssertionError: 0 != -1

======================================================================
FAIL: test_capture_persistent_scale_axis_filter_selftest_and_FIFO_change_rejected (test_embedded.Embedded.test_capture_persistent_scale_axis_filter_selftest_and_FIFO_change_rejected) (address=21, value=1)
----------------------------------------------------------------------
Traceback (most recent call last):
  File "/Users/guman/Documents/Codex/2026-10-05/kai-3/work/v37/negative-baseline/tests/test_embedded.py", line 194, in test_capture_persistent_scale_axis_filter_selftest_and_FIFO_change_rejected
    ret,_=self.drain(ctx,cap);self.assertEqual(ret,-1);self.assertEqual(cap.quality,4)
                              ^^^^^^^^^^^^^^^^^^^^^^^^
AssertionError: 0 != -1

======================================================================
FAIL: test_capture_persistent_scale_axis_filter_selftest_and_FIFO_change_rejected (test_embedded.Embedded.test_capture_persistent_scale_axis_filter_selftest_and_FIFO_change_rejected) (address=22, value=2)
----------------------------------------------------------------------
Traceback (most recent call last):
  File "/Users/guman/Documents/Codex/2026-10-05/kai-3/work/v37/negative-baseline/tests/test_embedded.py", line 194, in test_capture_persistent_scale_axis_filter_selftest_and_FIFO_change_rejected
    ret,_=self.drain(ctx,cap);self.assertEqual(ret,-1);self.assertEqual(cap.quality,4)
                              ^^^^^^^^^^^^^^^^^^^^^^^^
AssertionError: 0 != -1

======================================================================
FAIL: test_capture_persistent_scale_axis_filter_selftest_and_FIFO_change_rejected (test_embedded.Embedded.test_capture_persistent_scale_axis_filter_selftest_and_FIFO_change_rejected) (address=23, value=4)
----------------------------------------------------------------------
Traceback (most recent call last):
  File "/Users/guman/Documents/Codex/2026-10-05/kai-3/work/v37/negative-baseline/tests/test_embedded.py", line 194, in test_capture_persistent_scale_axis_filter_selftest_and_FIFO_change_rejected
    ret,_=self.drain(ctx,cap);self.assertEqual(ret,-1);self.assertEqual(cap.quality,4)
                              ^^^^^^^^^^^^^^^^^^^^^^^^
AssertionError: 0 != -1

======================================================================
FAIL: test_capture_persistent_scale_axis_filter_selftest_and_FIFO_change_rejected (test_embedded.Embedded.test_capture_persistent_scale_axis_filter_selftest_and_FIFO_change_rejected) (address=7, value=64)
----------------------------------------------------------------------
Traceback (most recent call last):
  File "/Users/guman/Documents/Codex/2026-10-05/kai-3/work/v37/negative-baseline/tests/test_embedded.py", line 194, in test_capture_persistent_scale_axis_filter_selftest_and_FIFO_change_rejected
    ret,_=self.drain(ctx,cap);self.assertEqual(ret,-1);self.assertEqual(cap.quality,4)
                              ^^^^^^^^^^^^^^^^^^^^^^^^
AssertionError: 0 != -1

======================================================================
FAIL: test_capture_persistent_scale_axis_filter_selftest_and_FIFO_change_rejected (test_embedded.Embedded.test_capture_persistent_scale_axis_filter_selftest_and_FIFO_change_rejected) (address=8, value=1)
----------------------------------------------------------------------
Traceback (most recent call last):
  File "/Users/guman/Documents/Codex/2026-10-05/kai-3/work/v37/negative-baseline/tests/test_embedded.py", line 194, in test_capture_persistent_scale_axis_filter_selftest_and_FIFO_change_rejected
    ret,_=self.drain(ctx,cap);self.assertEqual(ret,-1);self.assertEqual(cap.quality,4)
                              ^^^^^^^^^^^^^^^^^^^^^^^^
AssertionError: 0 != -1

======================================================================
FAIL: test_capture_persistent_scale_axis_filter_selftest_and_FIFO_change_rejected (test_embedded.Embedded.test_capture_persistent_scale_axis_filter_selftest_and_FIFO_change_rejected) (address=8, value=128)
----------------------------------------------------------------------
Traceback (most recent call last):
  File "/Users/guman/Documents/Codex/2026-10-05/kai-3/work/v37/negative-baseline/tests/test_embedded.py", line 194, in test_capture_persistent_scale_axis_filter_selftest_and_FIFO_change_rejected
    ret,_=self.drain(ctx,cap);self.assertEqual(ret,-1);self.assertEqual(cap.quality,4)
                              ^^^^^^^^^^^^^^^^^^^^^^^^
AssertionError: 0 != -1

======================================================================
FAIL: test_capture_persistent_scale_axis_filter_selftest_and_FIFO_change_rejected (test_embedded.Embedded.test_capture_persistent_scale_axis_filter_selftest_and_FIFO_change_rejected) (address=9, value=0)
----------------------------------------------------------------------
Traceback (most recent call last):
  File "/Users/guman/Documents/Codex/2026-10-05/kai-3/work/v37/negative-baseline/tests/test_embedded.py", line 194, in test_capture_persistent_scale_axis_filter_selftest_and_FIFO_change_rejected
    ret,_=self.drain(ctx,cap);self.assertEqual(ret,-1);self.assertEqual(cap.quality,4)
                              ^^^^^^^^^^^^^^^^^^^^^^^^
AssertionError: 0 != -1

======================================================================
FAIL: test_capture_persistent_scale_axis_filter_selftest_and_FIFO_change_rejected (test_embedded.Embedded.test_capture_persistent_scale_axis_filter_selftest_and_FIFO_change_rejected) (address=10, value=1)
----------------------------------------------------------------------
Traceback (most recent call last):
  File "/Users/guman/Documents/Codex/2026-10-05/kai-3/work/v37/negative-baseline/tests/test_embedded.py", line 194, in test_capture_persistent_scale_axis_filter_selftest_and_FIFO_change_rejected
    ret,_=self.drain(ctx,cap);self.assertEqual(ret,-1);self.assertEqual(cap.quality,4)
                              ^^^^^^^^^^^^^^^^^^^^^^^^
AssertionError: 0 != -1

======================================================================
FAIL: test_capture_persistent_scale_axis_filter_selftest_and_FIFO_change_rejected (test_embedded.Embedded.test_capture_persistent_scale_axis_filter_selftest_and_FIFO_change_rejected) (address=10, value=22)
----------------------------------------------------------------------
Traceback (most recent call last):
  File "/Users/guman/Documents/Codex/2026-10-05/kai-3/work/v37/negative-baseline/tests/test_embedded.py", line 194, in test_capture_persistent_scale_axis_filter_selftest_and_FIFO_change_rejected
    ret,_=self.drain(ctx,cap);self.assertEqual(ret,-1);self.assertEqual(cap.quality,4)
                              ^^^^^^^^^^^^^^^^^^^^^^^^
AssertionError: 0 != -1

======================================================================
FAIL: test_capture_persistent_scale_axis_filter_selftest_and_FIFO_change_rejected (test_embedded.Embedded.test_capture_persistent_scale_axis_filter_selftest_and_FIFO_change_rejected) (address=13, value=8)
----------------------------------------------------------------------
Traceback (most recent call last):
  File "/Users/guman/Documents/Codex/2026-10-05/kai-3/work/v37/negative-baseline/tests/test_embedded.py", line 194, in test_capture_persistent_scale_axis_filter_selftest_and_FIFO_change_rejected
    ret,_=self.drain(ctx,cap);self.assertEqual(ret,-1);self.assertEqual(cap.quality,4)
                              ^^^^^^^^^^^^^^^^^^^^^^^^
AssertionError: 0 != -1

----------------------------------------------------------------------
Ran 1 test in 0.681s

FAILED (failures=20)
