test_configuration_change_during_last_burst_rejects_completed_count (test_embedded.Embedded.test_configuration_change_during_last_burst_rejects_completed_count) ... FAIL

======================================================================
FAIL: test_configuration_change_during_last_burst_rejects_completed_count (test_embedded.Embedded.test_configuration_change_during_last_burst_rejects_completed_count)
----------------------------------------------------------------------
Traceback (most recent call last):
  File "/Users/guman/Documents/Codex/2026-10-05/kai-3/work/v37/negative-baseline/tests/test_embedded.py", line 199, in test_configuration_change_during_last_burst_rejects_completed_count
    self.assertEqual(cap.count,32768);self.assertEqual(ret,-1);self.assertEqual(cap.quality,4)
                                      ^^^^^^^^^^^^^^^^^^^^^^^^
AssertionError: 1 != -1

----------------------------------------------------------------------
Ran 1 test in 0.718s

FAILED (failures=1)
