test_configuration_read_IO_failure_before_or_after_burst_marks_fault (test_embedded.Embedded.test_configuration_read_IO_failure_before_or_after_burst_marks_fault) ... FAIL

======================================================================
FAIL: test_configuration_read_IO_failure_before_or_after_burst_marks_fault (test_embedded.Embedded.test_configuration_read_IO_failure_before_or_after_burst_marks_fault)
----------------------------------------------------------------------
Traceback (most recent call last):
  File "/Users/guman/Documents/Codex/2026-10-05/kai-3/work/v37/negative-baseline/tests/test_embedded.py", line 206, in test_configuration_read_IO_failure_before_or_after_burst_marks_fault
    ret,_=self.drain(ctx,cap);self.assertEqual(ret,-1);self.assertEqual(cap.quality,4)
                              ^^^^^^^^^^^^^^^^^^^^^^^^
AssertionError: 0 != -1

----------------------------------------------------------------------
Ran 1 test in 0.963s

FAILED (failures=1)
