test_live_scale_or_filter_change_invalidates_features_and_preserves_latch (test_monitor.Monitor.test_live_scale_or_filter_change_invalidates_features_and_preserves_latch) ... 
  test_live_scale_or_filter_change_invalidates_features_and_preserves_latch (test_monitor.Monitor.test_live_scale_or_filter_change_invalidates_features_and_preserves_latch) (address=16) ... FAIL
  test_live_scale_or_filter_change_invalidates_features_and_preserves_latch (test_monitor.Monitor.test_live_scale_or_filter_change_invalidates_features_and_preserves_latch) (address=23) ... FAIL

======================================================================
FAIL: test_live_scale_or_filter_change_invalidates_features_and_preserves_latch (test_monitor.Monitor.test_live_scale_or_filter_change_invalidates_features_and_preserves_latch) (address=16)
----------------------------------------------------------------------
Traceback (most recent call last):
  File "/Users/guman/Documents/Codex/2026-10-05/kai-3/work/v37/negative-baseline/tests/test_monitor.py", line 86, in test_live_scale_or_filter_change_invalidates_features_and_preserves_latch
    self.assertEqual(self.finish(),1);self.assertEqual(self.l.fixture_get(15)&4,4)
                                      ^^^^^^^^^^^^^^^^^^^^^^^^^^^^^^^^^^^^^^^^^^^^
AssertionError: 0 != 4

======================================================================
FAIL: test_live_scale_or_filter_change_invalidates_features_and_preserves_latch (test_monitor.Monitor.test_live_scale_or_filter_change_invalidates_features_and_preserves_latch) (address=23)
----------------------------------------------------------------------
Traceback (most recent call last):
  File "/Users/guman/Documents/Codex/2026-10-05/kai-3/work/v37/negative-baseline/tests/test_monitor.py", line 86, in test_live_scale_or_filter_change_invalidates_features_and_preserves_latch
    self.assertEqual(self.finish(),1);self.assertEqual(self.l.fixture_get(15)&4,4)
                                      ^^^^^^^^^^^^^^^^^^^^^^^^^^^^^^^^^^^^^^^^^^^^
AssertionError: 0 != 4

----------------------------------------------------------------------
Ran 1 test in 1.007s

FAILED (failures=2)
