test_actual_cold_entry_4020_conversion_and_cleanup (test_bench_nominal.BenchNominal.test_actual_cold_entry_4020_conversion_and_cleanup) ... 
  test_actual_cold_entry_4020_conversion_and_cleanup (test_bench_nominal.BenchNominal.test_actual_cold_entry_4020_conversion_and_cleanup) (target='h743', t=-39) ... FAIL
  test_actual_cold_entry_4020_conversion_and_cleanup (test_bench_nominal.BenchNominal.test_actual_cold_entry_4020_conversion_and_cleanup) (target='h743', t=-20) ... FAIL
  test_actual_cold_entry_4020_conversion_and_cleanup (test_bench_nominal.BenchNominal.test_actual_cold_entry_4020_conversion_and_cleanup) (target='h743', t=0) ... FAIL
  test_actual_cold_entry_4020_conversion_and_cleanup (test_bench_nominal.BenchNominal.test_actual_cold_entry_4020_conversion_and_cleanup) (target='h743', t=25) ... FAIL
  test_actual_cold_entry_4020_conversion_and_cleanup (test_bench_nominal.BenchNominal.test_actual_cold_entry_4020_conversion_and_cleanup) (target='h743', t=80) ... FAIL
  test_actual_cold_entry_4020_conversion_and_cleanup (test_bench_nominal.BenchNominal.test_actual_cold_entry_4020_conversion_and_cleanup) (target='h743', t=120) ... FAIL
  test_actual_cold_entry_4020_conversion_and_cleanup (test_bench_nominal.BenchNominal.test_actual_cold_entry_4020_conversion_and_cleanup) (target='h743', t=149) ... FAIL
  test_actual_cold_entry_4020_conversion_and_cleanup (test_bench_nominal.BenchNominal.test_actual_cold_entry_4020_conversion_and_cleanup) (target='u585', t=-39) ... FAIL
  test_actual_cold_entry_4020_conversion_and_cleanup (test_bench_nominal.BenchNominal.test_actual_cold_entry_4020_conversion_and_cleanup) (target='u585', t=-20) ... FAIL
  test_actual_cold_entry_4020_conversion_and_cleanup (test_bench_nominal.BenchNominal.test_actual_cold_entry_4020_conversion_and_cleanup) (target='u585', t=0) ... FAIL
  test_actual_cold_entry_4020_conversion_and_cleanup (test_bench_nominal.BenchNominal.test_actual_cold_entry_4020_conversion_and_cleanup) (target='u585', t=25) ... FAIL
  test_actual_cold_entry_4020_conversion_and_cleanup (test_bench_nominal.BenchNominal.test_actual_cold_entry_4020_conversion_and_cleanup) (target='u585', t=80) ... FAIL
  test_actual_cold_entry_4020_conversion_and_cleanup (test_bench_nominal.BenchNominal.test_actual_cold_entry_4020_conversion_and_cleanup) (target='u585', t=120) ... FAIL
  test_actual_cold_entry_4020_conversion_and_cleanup (test_bench_nominal.BenchNominal.test_actual_cold_entry_4020_conversion_and_cleanup) (target='u585', t=149) ... FAIL

======================================================================
FAIL: test_actual_cold_entry_4020_conversion_and_cleanup (test_bench_nominal.BenchNominal.test_actual_cold_entry_4020_conversion_and_cleanup) (target='h743', t=-39)
----------------------------------------------------------------------
Traceback (most recent call last):
  File "/Users/guman/Documents/Codex/2026-10-05/kai-3/work/v38/negative-baseline/tests/test_bench_nominal.py", line 31, in test_actual_cold_entry_4020_conversion_and_cleanup
    self.assertAlmostEqual(l.bench_cold_float(0),t,delta=.02)
AssertionError: -24.069398880004883 != -39 within 0.02 delta (14.930601119995117 difference)

======================================================================
FAIL: test_actual_cold_entry_4020_conversion_and_cleanup (test_bench_nominal.BenchNominal.test_actual_cold_entry_4020_conversion_and_cleanup) (target='h743', t=-20)
----------------------------------------------------------------------
Traceback (most recent call last):
  File "/Users/guman/Documents/Codex/2026-10-05/kai-3/work/v38/negative-baseline/tests/test_bench_nominal.py", line 31, in test_actual_cold_entry_4020_conversion_and_cleanup
    self.assertAlmostEqual(l.bench_cold_float(0),t,delta=.02)
AssertionError: -3.639875650405884 != -20 within 0.02 delta (16.360124349594116 difference)

======================================================================
FAIL: test_actual_cold_entry_4020_conversion_and_cleanup (test_bench_nominal.BenchNominal.test_actual_cold_entry_4020_conversion_and_cleanup) (target='h743', t=0)
----------------------------------------------------------------------
Traceback (most recent call last):
  File "/Users/guman/Documents/Codex/2026-10-05/kai-3/work/v38/negative-baseline/tests/test_bench_nominal.py", line 31, in test_actual_cold_entry_4020_conversion_and_cleanup
    self.assertAlmostEqual(l.bench_cold_float(0),t,delta=.02)
AssertionError: 17.860443115234375 != 0 within 0.02 delta (17.860443115234375 difference)

======================================================================
FAIL: test_actual_cold_entry_4020_conversion_and_cleanup (test_bench_nominal.BenchNominal.test_actual_cold_entry_4020_conversion_and_cleanup) (target='h743', t=25)
----------------------------------------------------------------------
Traceback (most recent call last):
  File "/Users/guman/Documents/Codex/2026-10-05/kai-3/work/v38/negative-baseline/tests/test_bench_nominal.py", line 31, in test_actual_cold_entry_4020_conversion_and_cleanup
    self.assertAlmostEqual(l.bench_cold_float(0),t,delta=.02)
AssertionError: 44.7689094543457 != 25 within 0.02 delta (19.768909454345703 difference)

======================================================================
FAIL: test_actual_cold_entry_4020_conversion_and_cleanup (test_bench_nominal.BenchNominal.test_actual_cold_entry_4020_conversion_and_cleanup) (target='h743', t=80)
----------------------------------------------------------------------
Traceback (most recent call last):
  File "/Users/guman/Documents/Codex/2026-10-05/kai-3/work/v38/negative-baseline/tests/test_bench_nominal.py", line 31, in test_actual_cold_entry_4020_conversion_and_cleanup
    self.assertAlmostEqual(l.bench_cold_float(0),t,delta=.02)
AssertionError: 103.98944854736328 != 80 within 0.02 delta (23.98944854736328 difference)

======================================================================
FAIL: test_actual_cold_entry_4020_conversion_and_cleanup (test_bench_nominal.BenchNominal.test_actual_cold_entry_4020_conversion_and_cleanup) (target='h743', t=120)
----------------------------------------------------------------------
Traceback (most recent call last):
  File "/Users/guman/Documents/Codex/2026-10-05/kai-3/work/v38/negative-baseline/tests/test_bench_nominal.py", line 31, in test_actual_cold_entry_4020_conversion_and_cleanup
    self.assertAlmostEqual(l.bench_cold_float(0),t,delta=.02)
AssertionError: 147.08851623535156 != 120 within 0.02 delta (27.088516235351562 difference)

======================================================================
FAIL: test_actual_cold_entry_4020_conversion_and_cleanup (test_bench_nominal.BenchNominal.test_actual_cold_entry_4020_conversion_and_cleanup) (target='h743', t=149)
----------------------------------------------------------------------
Traceback (most recent call last):
  File "/Users/guman/Documents/Codex/2026-10-05/kai-3/work/v38/negative-baseline/tests/test_bench_nominal.py", line 29, in test_actual_cold_entry_4020_conversion_and_cleanup
    self.assertEqual(l.bench_cold_get(0),4);self.assertEqual(l.bench_cold_get(1),0)
    ^^^^^^^^^^^^^^^^^^^^^^^^^^^^^^^^^^^^^^^
AssertionError: 2 != 4

======================================================================
FAIL: test_actual_cold_entry_4020_conversion_and_cleanup (test_bench_nominal.BenchNominal.test_actual_cold_entry_4020_conversion_and_cleanup) (target='u585', t=-39)
----------------------------------------------------------------------
Traceback (most recent call last):
  File "/Users/guman/Documents/Codex/2026-10-05/kai-3/work/v38/negative-baseline/tests/test_bench_nominal.py", line 31, in test_actual_cold_entry_4020_conversion_and_cleanup
    self.assertAlmostEqual(l.bench_cold_float(0),t,delta=.02)
AssertionError: -24.069398880004883 != -39 within 0.02 delta (14.930601119995117 difference)

======================================================================
FAIL: test_actual_cold_entry_4020_conversion_and_cleanup (test_bench_nominal.BenchNominal.test_actual_cold_entry_4020_conversion_and_cleanup) (target='u585', t=-20)
----------------------------------------------------------------------
Traceback (most recent call last):
  File "/Users/guman/Documents/Codex/2026-10-05/kai-3/work/v38/negative-baseline/tests/test_bench_nominal.py", line 31, in test_actual_cold_entry_4020_conversion_and_cleanup
    self.assertAlmostEqual(l.bench_cold_float(0),t,delta=.02)
AssertionError: -3.639875650405884 != -20 within 0.02 delta (16.360124349594116 difference)

======================================================================
FAIL: test_actual_cold_entry_4020_conversion_and_cleanup (test_bench_nominal.BenchNominal.test_actual_cold_entry_4020_conversion_and_cleanup) (target='u585', t=0)
----------------------------------------------------------------------
Traceback (most recent call last):
  File "/Users/guman/Documents/Codex/2026-10-05/kai-3/work/v38/negative-baseline/tests/test_bench_nominal.py", line 31, in test_actual_cold_entry_4020_conversion_and_cleanup
    self.assertAlmostEqual(l.bench_cold_float(0),t,delta=.02)
AssertionError: 17.860443115234375 != 0 within 0.02 delta (17.860443115234375 difference)

======================================================================
FAIL: test_actual_cold_entry_4020_conversion_and_cleanup (test_bench_nominal.BenchNominal.test_actual_cold_entry_4020_conversion_and_cleanup) (target='u585', t=25)
----------------------------------------------------------------------
Traceback (most recent call last):
  File "/Users/guman/Documents/Codex/2026-10-05/kai-3/work/v38/negative-baseline/tests/test_bench_nominal.py", line 31, in test_actual_cold_entry_4020_conversion_and_cleanup
    self.assertAlmostEqual(l.bench_cold_float(0),t,delta=.02)
AssertionError: 44.7689094543457 != 25 within 0.02 delta (19.768909454345703 difference)

======================================================================
FAIL: test_actual_cold_entry_4020_conversion_and_cleanup (test_bench_nominal.BenchNominal.test_actual_cold_entry_4020_conversion_and_cleanup) (target='u585', t=80)
----------------------------------------------------------------------
Traceback (most recent call last):
  File "/Users/guman/Documents/Codex/2026-10-05/kai-3/work/v38/negative-baseline/tests/test_bench_nominal.py", line 31, in test_actual_cold_entry_4020_conversion_and_cleanup
    self.assertAlmostEqual(l.bench_cold_float(0),t,delta=.02)
AssertionError: 103.98944854736328 != 80 within 0.02 delta (23.98944854736328 difference)

======================================================================
FAIL: test_actual_cold_entry_4020_conversion_and_cleanup (test_bench_nominal.BenchNominal.test_actual_cold_entry_4020_conversion_and_cleanup) (target='u585', t=120)
----------------------------------------------------------------------
Traceback (most recent call last):
  File "/Users/guman/Documents/Codex/2026-10-05/kai-3/work/v38/negative-baseline/tests/test_bench_nominal.py", line 31, in test_actual_cold_entry_4020_conversion_and_cleanup
    self.assertAlmostEqual(l.bench_cold_float(0),t,delta=.02)
AssertionError: 147.08851623535156 != 120 within 0.02 delta (27.088516235351562 difference)

======================================================================
FAIL: test_actual_cold_entry_4020_conversion_and_cleanup (test_bench_nominal.BenchNominal.test_actual_cold_entry_4020_conversion_and_cleanup) (target='u585', t=149)
----------------------------------------------------------------------
Traceback (most recent call last):
  File "/Users/guman/Documents/Codex/2026-10-05/kai-3/work/v38/negative-baseline/tests/test_bench_nominal.py", line 29, in test_actual_cold_entry_4020_conversion_and_cleanup
    self.assertEqual(l.bench_cold_get(0),4);self.assertEqual(l.bench_cold_get(1),0)
    ^^^^^^^^^^^^^^^^^^^^^^^^^^^^^^^^^^^^^^^
AssertionError: 2 != 4

----------------------------------------------------------------------
Ran 1 test in 1.244s

FAILED (failures=14)
