test_actual_monitor_entry_passes_bom_nominal_to_init (test_bench_nominal.BenchNominal.test_actual_monitor_entry_passes_bom_nominal_to_init) ... FAIL

======================================================================
FAIL: test_actual_monitor_entry_passes_bom_nominal_to_init (test_bench_nominal.BenchNominal.test_actual_monitor_entry_passes_bom_nominal_to_init)
----------------------------------------------------------------------
Traceback (most recent call last):
  File "/Users/guman/Documents/Codex/2026-10-05/kai-3/work/v38/negative-baseline/tests/test_bench_nominal.py", line 45, in test_actual_monitor_entry_passes_bom_nominal_to_init
    self.assertEqual(l.bench_config_float(0),4020);self.assertEqual(l.bench_config_float(1),1000)
    ^^^^^^^^^^^^^^^^^^^^^^^^^^^^^^^^^^^^^^^^^^^^^^
AssertionError: 4300.0 != 4020

----------------------------------------------------------------------
Ran 1 test in 1.276s

FAILED (failures=1)
