test_startup_us_single_channel_never_requests_rf (test_rui3.RUI3.test_startup_us_single_channel_never_requests_rf) ... FAIL

======================================================================
FAIL: test_startup_us_single_channel_never_requests_rf (test_rui3.RUI3.test_startup_us_single_channel_never_requests_rf)
----------------------------------------------------------------------
Traceback (most recent call last):
  File "/private/var/folders/67/hsczbvd54wn_d2g_g7jpq3g40000gn/T/mvt-v40-negative-bu9_z6kt/F/tests/test_rui3.py", line 86, in test_startup_us_single_channel_never_requests_rf
    self.fault(h,1,2);self.assertFalse(any(b'AT+JOIN=' in x or b'AT+SEND=' in x for x in h.writes))
    ^^^^^^^^^^^^^^^^^
  File "/private/var/folders/67/hsczbvd54wn_d2g_g7jpq3g40000gn/T/mvt-v40-negative-bu9_z6kt/F/tests/test_rui3.py", line 77, in fault
    self.assertEqual((h.get(),h.get(1),h.halts),(8,why,1))
AssertionError: Tuples differ: (4, 0, 0) != (8, 1, 1)

First differing element 0:
4
8

- (4, 0, 0)
+ (8, 1, 1)

----------------------------------------------------------------------
Ran 1 test in 0.633s

FAILED (failures=1)
