test_presend_radio_mutation_rejected_before_send (test_rui3.RUI3.test_presend_radio_mutation_rejected_before_send) ... FAIL

======================================================================
FAIL: test_presend_radio_mutation_rejected_before_send (test_rui3.RUI3.test_presend_radio_mutation_rejected_before_send)
----------------------------------------------------------------------
Traceback (most recent call last):
  File "/private/var/folders/67/hsczbvd54wn_d2g_g7jpq3g40000gn/T/mvt-v40-negative-bu9_z6kt/F/tests/test_rui3.py", line 92, in test_presend_radio_mutation_rejected_before_send
    self.assertEqual(h.cmd(),'AT+'+k+'=?');h.reply('AT+'+k+'='+(bad if k==key else v))
    ^^^^^^^^^^^^^^^^^^^^^^^^^^^^^^^^^^^^^^
AssertionError: 'AT+DR=?' != 'AT+TXP=?'
- AT+DR=?
+ AT+TXP=?


----------------------------------------------------------------------
Ran 1 test in 1.006s

FAILED (failures=1)
